ruby-dev jp

This forum is an archive for the mailing list ruby-dev@ruby-lang.org (more options) Messages posted here will be sent to this mailing list.
Ruby developers' mailing list.
1234 ... 81
Topics (2824)
Replies Last Post Views
[ruby-dev:40474] [Bug #2787] nil.instance_eval pushes nil onto cref by Dennis Ranke-2
1
by Dennis Ranke-2
[ruby-dev:40467] Re: [ruby-cvs:33954] Ruby:r26739 (trunk): * ext/openssl/ossl_digest.c (GetDigestPtr): Allow to pass the by NARUSE, Yui-2
5
by Akinori MUSHA
[ruby-dev:40471] improving handling of reserved names in OpenStruct by Akinori MUSHA
0
by Akinori MUSHA
[ruby-dev:40461] respond_to?(<protected method name>) returns true by Akinori MUSHA
5
by Yukihiro Matsumoto
[ruby-dev:40453] [Bug #2776] can't return from lambda with outer block by Dennis Ranke-2
5
by Tanaka Akira-3
[ruby-dev:40452] [bug:trunk] Invalid read of size 4 by redefining load by Tanaka Akira-3
2
by SASADA Koichi
[ruby-dev:40451] [Bug:trunk] add explicit constraints for WONTFIX IO bug by Yusuke ENDOH
0
by Yusuke ENDOH
[ruby-dev:40449] [Bug:trunk] gem install cairo fails by Yusuke ENDOH
1
by Dennis Ranke-2
[ruby-dev:40279] [Bug:1.9.1] rubyspec: BigDecimal#div returns NaN if divided by zero and no precision given ERROR by Yusuke ENDOH
1
by Yugui (Yuki Sonoda)
[ruby-dev:40424] [Bug #2747] io.dup doesn't handle pos properly by Dennis Ranke-2
4
by Yusuke ENDOH
[ruby-dev:40440] repeat of DRb.start_service and DRb.stop_service may result in EADDRINUSE by Yusuke ENDOH
2
by Yusuke ENDOH
[ruby-dev:40418] [Feature #2746] ビルドする拡張ライブラリを configure 時に指定するための --with-exts オプション by Dennis Ranke-2
10
by Kenta Murata
[ruby-dev:40298] Re: [ruby-cvs:33760] Ruby:r26545 (trunk): Wed Feb 3 10:12:09 2010 Aaron Patterson <tenderlove@ruby-lang.org> by NARUSE, Yui-2
17
by NARUSE, Yui-2
[ruby-dev:40439] [Bug #2752] File path encoding on mac os x and windows by Dennis Ranke-2
0
by Dennis Ranke-2
[ruby-dev:40317] [Bug:trunk] TCPServer#gets gets stuck by Yusuke ENDOH
18
by NARUSE, Yui-2
[ruby-dev:40382] [Bug:trunk] rubyspec: ObjectSpace.define_finalizer doesn't call self-referencing finalizers FAILED by Yusuke ENDOH
8
by Dennis Ranke-2
[ruby-dev:40430] [Bug #2748] fix for READ_CHECK causes failures on FreeBSD 8.0 by Dennis Ranke-2
1
by Yusuke ENDOH
[ruby-dev:40387] [Bug #2516] IO#reopen Compatibility (original: ) by Dennis Ranke-2
3
by Yusuke ENDOH
[ruby-dev:40414] Re: [ruby-cvs:33873] Ruby:r26658 (trunk): * marshal.c (id2encidx): duplicated entry for encoding name. by Tanaka Akira-3
2
by Tanaka Akira-3
[ruby-dev:40384] [Bug:trunk] rubyspec: Time#+ rounds micro seconds rather than truncates FAILED by Yusuke ENDOH
5
by Tanaka Akira-3
[ruby-dev:40162] [Bug #2658] rubyspec: Ruby character strings interpolates the return value of Object#inspect, without ivars, if Object#to_s does not return a String instance ERROR by Dennis Ranke-2
7
by Yusuke ENDOH
[ruby-dev:40379] rubyspec: File.new raises an Errno::EINVAL error with File::APPEND FAILED by Yusuke ENDOH
2
by Yusuke ENDOH
[ruby-dev:40395] [Bug #2735] miniruby make failed on powerpc-darwin9.8.0 by Dennis Ranke-2
1
by Dennis Ranke-2
[ruby-dev:40388] [bug:trunk] marshal changes ["foo", "bar", "bar"] to ["foo", "bar", "EUC-JP"] by Tanaka Akira-3
0
by Tanaka Akira-3
[ruby-dev:40386] [bug:trunk] regexp marshal problem from 1.9.1 to 1.9.2 by Tanaka Akira-3
0
by Tanaka Akira-3
[ruby-dev:39685] [Feature #2366] private constant by Dennis Ranke-2
21
by Yusuke ENDOH
[ruby-dev:40377] [Bug #2727] make: *** [encdb.h] Aborted by Dennis Ranke-2
0
by Dennis Ranke-2
[ruby-dev:35372] patch for ruby-core:17472 by wanabe
15
by Yusuke ENDOH
[ruby-dev:39669] メンテナ確認プロセス終了。メンテナ募集 by Yugui (Yuki Sonoda)
9
by Yusuke ENDOH
[ruby-dev:40359] trunk \w match by WATANABE Tetsuya
6
by WATANABE Tetsuya
[ruby-dev:40354] [Bug #2724] fork from other than the main thread causes wrong pthread condition on NetBSD by Dennis Ranke-2
0
by Dennis Ranke-2
[ruby-dev:40296] nkf MINE encoding bug by Makoto Kishimoto
1
by NARUSE, Yui-2
[ruby-dev:40258] [Feature #2693] unfriendly exception when command executed for Net::FTP which is not connected by Dennis Ranke-2
1
by Dennis Ranke-2
[ruby-dev:40334] [Bug #2716] make main is stopped by error in compile_prelude.rb by Dennis Ranke-2
2
by Dennis Ranke-2
[ruby-dev:40271] [Bug:trunk] rubyspec: StringIO#ungetc when passed [char] pads with \000 when the current position is after the end ERROR by Yusuke ENDOH
2
by Dennis Ranke-2
1234 ... 81