ruby Japanese

1234 ... 125
Topics (4341)
Replies Last Post Views Sub Forum
[ruby-math:01028] by SONE Toshihiko
0
by SONE Toshihiko
ruby-math jp
[ruby-ext:02333] by SONE Toshihiko
0
by SONE Toshihiko
ruby-ext jp
[ruby-ext:02332] Re: Welcome to our (ruby-ext ML) You are added automatically by noriaki watanabe
0
by noriaki watanabe
ruby-ext jp
[ruby-dev:40474] [Bug #2787] nil.instance_eval pushes nil onto cref by Dennis Ranke-2
1
by Dennis Ranke-2
ruby-dev jp
[ruby-dev:40467] Re: [ruby-cvs:33954] Ruby:r26739 (trunk): * ext/openssl/ossl_digest.c (GetDigestPtr): Allow to pass the by NARUSE, Yui-2
5
by Akinori MUSHA
ruby-dev jp
[ruby-dev:40471] improving handling of reserved names in OpenStruct by Akinori MUSHA
0
by Akinori MUSHA
ruby-dev jp
[ruby-dev:40461] respond_to?(<protected method name>) returns true by Akinori MUSHA
5
by Yukihiro Matsumoto
ruby-dev jp
[ruby-dev:40453] [Bug #2776] can't return from lambda with outer block by Dennis Ranke-2
5
by Tanaka Akira-3
ruby-dev jp
[ruby-list:46408] html→csv変換|tableのセル結合に対応したものは? by YOSHIIZUMI
6
by Shin-ichiro HARA
ruby-list jp
[ruby-list:46871] [ANN] Sapporo.rb-2010.02.25 by Kenta Murata
0
by Kenta Murata
ruby-list jp
[ruby-dev:40452] [bug:trunk] Invalid read of size 4 by redefining load by Tanaka Akira-3
2
by SASADA Koichi
ruby-dev jp
[ruby-dev:40451] [Bug:trunk] add explicit constraints for WONTFIX IO bug by Yusuke ENDOH
0
by Yusuke ENDOH
ruby-dev jp
[ruby-dev:40449] [Bug:trunk] gem install cairo fails by Yusuke ENDOH
1
by Dennis Ranke-2
ruby-dev jp
[ruby-dev:40279] [Bug:1.9.1] rubyspec: BigDecimal#div returns NaN if divided by zero and no precision given ERROR by Yusuke ENDOH
1
by Yugui (Yuki Sonoda)
ruby-dev jp
[ruby-dev:40424] [Bug #2747] io.dup doesn't handle pos properly by Dennis Ranke-2
4
by Yusuke ENDOH
ruby-dev jp
[ruby-list:46863] []= メソッドの第一引数を省略したい by Yuya Takeyama
3
by 西 啓一朗
ruby-list jp
[ruby-dev:40440] repeat of DRb.start_service and DRb.stop_service may result in EADDRINUSE by Yusuke ENDOH
2
by Yusuke ENDOH
ruby-dev jp
[ruby-dev:40418] [Feature #2746] ビルドする拡張ライブラリを configure 時に指定するための --with-exts オプション by Dennis Ranke-2
10
by Kenta Murata
ruby-dev jp
[ruby-dev:40298] Re: [ruby-cvs:33760] Ruby:r26545 (trunk): Wed Feb 3 10:12:09 2010 Aaron Patterson <tenderlove@ruby-lang.org> by NARUSE, Yui-2
17
by NARUSE, Yui-2
ruby-dev jp
[ruby-dev:40439] [Bug #2752] File path encoding on mac os x and windows by Dennis Ranke-2
0
by Dennis Ranke-2
ruby-dev jp
[ruby-list:46861] [ANN] isi-1.2.1 is released with isi2bibtex and isi2html by Takeshi NISHIMATSU
0
by Takeshi NISHIMATSU
ruby-list jp
[ruby-list:46858] ruby 1.8.7p249 : inspectで文字化け by 亀田義裕
2
by 亀田義裕
ruby-list jp
[ruby-dev:40317] [Bug:trunk] TCPServer#gets gets stuck by Yusuke ENDOH
18
by NARUSE, Yui-2
ruby-dev jp
[ruby-dev:40382] [Bug:trunk] rubyspec: ObjectSpace.define_finalizer doesn't call self-referencing finalizers FAILED by Yusuke ENDOH
8
by Dennis Ranke-2
ruby-dev jp
[ruby-dev:40430] [Bug #2748] fix for READ_CHECK causes failures on FreeBSD 8.0 by Dennis Ranke-2
1
by Yusuke ENDOH
ruby-dev jp
[ruby-dev:40387] [Bug #2516] IO#reopen Compatibility (original: ) by Dennis Ranke-2
3
by Yusuke ENDOH
ruby-dev jp
[ruby-dev:40414] Re: [ruby-cvs:33873] Ruby:r26658 (trunk): * marshal.c (id2encidx): duplicated entry for encoding name. by Tanaka Akira-3
2
by Tanaka Akira-3
ruby-dev jp
[ruby-dev:40384] [Bug:trunk] rubyspec: Time#+ rounds micro seconds rather than truncates FAILED by Yusuke ENDOH
5
by Tanaka Akira-3
ruby-dev jp
[ruby-dev:40162] [Bug #2658] rubyspec: Ruby character strings interpolates the return value of Object#inspect, without ivars, if Object#to_s does not return a String instance ERROR by Dennis Ranke-2
7
by Yusuke ENDOH
ruby-dev jp
[ruby-dev:40379] rubyspec: File.new raises an Errno::EINVAL error with File::APPEND FAILED by Yusuke ENDOH
2
by Yusuke ENDOH
ruby-dev jp
[ruby-dev:40395] [Bug #2735] miniruby make failed on powerpc-darwin9.8.0 by Dennis Ranke-2
1
by Dennis Ranke-2
ruby-dev jp
[ruby-dev:40388] [bug:trunk] marshal changes ["foo", "bar", "bar"] to ["foo", "bar", "EUC-JP"] by Tanaka Akira-3
0
by Tanaka Akira-3
ruby-dev jp
[ruby-dev:40386] [bug:trunk] regexp marshal problem from 1.9.1 to 1.9.2 by Tanaka Akira-3
0
by Tanaka Akira-3
ruby-dev jp
[ruby-dev:39685] [Feature #2366] private constant by Dennis Ranke-2
21
by Yusuke ENDOH
ruby-dev jp
[ruby-dev:40377] [Bug #2727] make: *** [encdb.h] Aborted by Dennis Ranke-2
0
by Dennis Ranke-2
ruby-dev jp
1234 ... 125